Reaction Details
TargetOxysterols receptor LXR-beta
LigandBDBM304419
Substrate/Competitorn/a
Meas. Tech.LXR alpha/beta Radioligand Binding Assay
Ki 2.00±n/a nM
Citation Claremon, DADong, CFan, YLeftheris, KLotesta, SDSingh, SBTice, CMZhao, WZheng, YZhuang, L Piperazine derivatives as liver X receptor modulators US Patent US10144715 Publication Date 12/4/2018
 
Oxysterols receptor LXR-beta
Name:Oxysterols receptor LXR-beta
Type:Enzyme Catalytic Domain
Mol. Mass.:50978.79
Organism:Homo sapiens (Human)
Description:P55055
Residue:460
BDBM304419
NameBDBM304419
Synonyms:(R)-(2-fluoro-4-(4-(5-(hydroxymethyl)-4-(trifluoromethyl)pyrimidin-2-yl)-3-isopropylpiperazin-1-yl)-6-(methylsulfonyl)phenyl)methanol | US10144715, Compound 11-6
TypeSmall organic molecule
Emp. Form.C21H26F4N4O4S
Mol. Mass.506.514
SMILESCC(C)[C@@H]1CN(CCN1c1ncc(CO)c(n1)C(F)(F)F)c1cc(F)c(CO)c(c1)S(C)(=O)=O