Reaction Details
TargetOxysterols receptor LXR-beta
LigandBDBM304438
Substrate/Competitorn/a
Meas. Tech.LXR alpha/beta Radioligand Binding Assay
Ki 4.00±n/a nM
Citation Claremon, DADong, CFan, YLeftheris, KLotesta, SDSingh, SBTice, CMZhao, WZheng, YZhuang, L Piperazine derivatives as liver X receptor modulators US Patent US10144715 Publication Date 12/4/2018
 
Oxysterols receptor LXR-beta
Name:Oxysterols receptor LXR-beta
Type:Enzyme Catalytic Domain
Mol. Mass.:50978.79
Organism:Homo sapiens (Human)
Description:P55055
Residue:460
BDBM304438
NameBDBM304438
Synonyms:2-fluoro-5-((3R)-4-(5-(1-hydroxyethyl)-4-(trifluoromethyl)pyrimidin-2-yl)-3-isopropylpiperazin-1-yl)-N-methylbenzenesulfonamide | US10144715, Compound 12-8
TypeSmall organic molecule
Emp. Form.C21H27F4N5O3S
Mol. Mass.505.529
SMILESCNS(=O)(=O)c1cc(ccc1F)N1CCN([C@@H](C1)C(C)C)c1ncc(C(C)O)c(n1)C(F)(F)F