Reaction Details
TargetOxysterols receptor LXR-alpha
LigandBDBM304510
Substrate/Competitorn/a
Meas. Tech.LXR alpha/beta Radioligand Binding Assay
Ki 111±n/a nM
Citation Claremon, DADong, CFan, YLeftheris, KLotesta, SDSingh, SBTice, CMZhao, WZheng, YZhuang, L Piperazine derivatives as liver X receptor modulators US Patent US10144715 Publication Date 12/4/2018
 
Oxysterols receptor LXR-alpha
Name:Oxysterols receptor LXR-alpha
Type:Enzyme Catalytic Domain
Mol. Mass.:50403.85
Organism:Homo sapiens (Human)
Description:Q13133
Residue:447
BDBM304510
NameBDBM304510
Synonyms:(R)-2-(2-(4-(4-fluoro-3-(methylsulfonyl)phenyl)-2-isopropylpiperazin-1-yl)-4-(trifluoromethyl)thiazol-5-yl)propan-2-ol | US10144715, Compound 26-1
TypeSmall organic molecule
Emp. Form.C21H27F4N3O3S2
Mol. Mass.509.581
SMILESCC(C)[C@@H]1CN(CCN1c1nc(c(s1)C(C)(C)O)C(F)(F)F)c1ccc(F)c(c1)S(C)(=O)=O