Reaction Details
TargetOxysterols receptor LXR-alpha
LigandBDBM304521
Substrate/Competitorn/a
Meas. Tech.LXR alpha/beta Radioligand Binding Assay
Ki 30.0±n/a nM
Citation Claremon, DADong, CFan, YLeftheris, KLotesta, SDSingh, SBTice, CMZhao, WZheng, YZhuang, L Piperazine derivatives as liver X receptor modulators US Patent US10144715 Publication Date 12/4/2018
 
Oxysterols receptor LXR-alpha
Name:Oxysterols receptor LXR-alpha
Type:Enzyme Catalytic Domain
Mol. Mass.:50403.85
Organism:Homo sapiens (Human)
Description:Q13133
Residue:447
BDBM304521
NameBDBM304521
Synonyms:(R)-4-chloro-2-(4-(4-fluoro-3-(methylsulfonyl)phenyl)-2-isopropylpiperazin-1-yl)-5-(trifluoromethyl)pyrimidine US10144715, Compound 43-1
TypeSmall organic molecule
Emp. Form.C19H21ClF4N4O2S
Mol. Mass.480.907
SMILESCC(C)[C@@H]1CN(CCN1c1ncc(c(Cl)n1)C(F)(F)F)c1ccc(F)c(c1)S(C)(=O)=O