Reaction Details
TargetOxysterols receptor LXR-alpha
LigandBDBM304609
Substrate/Competitorn/a
Meas. Tech.LXR alpha/beta Radioligand Binding Assay
Ki 39.0±n/a nM
Citation Claremon, DADong, CFan, YLeftheris, KLotesta, SDSingh, SBTice, CMZhao, WZheng, YZhuang, L Piperazine derivatives as liver X receptor modulators US Patent US10144715 Publication Date 12/4/2018
 
Oxysterols receptor LXR-alpha
Name:Oxysterols receptor LXR-alpha
Type:Enzyme Catalytic Domain
Mol. Mass.:50403.85
Organism:Homo sapiens (Human)
Description:Q13133
Residue:447
BDBM304609
NameBDBM304609
Synonyms:(S)-1-((4,4-dimethylcyclohexyl)methyl)-4-(3-(methylsulfonyl)phenyl)-2-phenylpiperazine | US10144715, Compound 48-4
TypeSmall organic molecule
Emp. Form.C26H34N2O3S
Mol. Mass.454.625
SMILESCC1(C)CCC(CC1)C(=O)N1CCN(C[C@@H]1c1ccccc1)c1cccc(c1)S(C)(=O)=O