Reaction Details
TargetOxysterols receptor LXR-alpha
LigandBDBM304682
Substrate/Competitorn/a
Meas. Tech.LXR alpha/beta Radioligand Binding Assay
Ki 30.0±n/a nM
Citation Claremon, DADong, CFan, YLeftheris, KLotesta, SDSingh, SBTice, CMZhao, WZheng, YZhuang, L Piperazine derivatives as liver X receptor modulators US Patent US10144715 Publication Date 12/4/2018
 
Oxysterols receptor LXR-alpha
Name:Oxysterols receptor LXR-alpha
Type:Enzyme Catalytic Domain
Mol. Mass.:50403.85
Organism:Homo sapiens (Human)
Description:Q13133
Residue:447
BDBM304682
NameBDBM304682
Synonyms:(4-((S)-3-isopropyl-4-(((1s,4R)-4-methoxy-4-(trifluoromethyl)cyclohexyl)methyl)piperazin-1-yl)-2-(methylsulfonyl)phenyl)methanol | US10144715, Compound 48-80
TypeSmall organic molecule
Emp. Form.C24H37F3N2O4S
Mol. Mass.506.622
SMILESCO[C@@]1(CC[C@H](CN2CCN(C[C@@H]2C(C)C)c2ccc(CO)c(c2)S(C)(=O)=O)CC1)C(F)(F)F