Reaction Details
TargetEstrogen receptor
LigandBDBM306772
Substrate/Competitorn/a
Meas. Tech.MCF-7 ER Down-Regulation Assay
IC50 0.087±n/a nM
Citation Scott, JSMoss, TAO Donovan, DHNissink, JWHughes, SJBarlaam, BCBroo, DAYang, BVarnes, JGWu, D Chemical compounds US Patent US10149839 Publication Date 12/11/2018
 
Estrogen receptor
Name:Estrogen receptor
Type:Protein
Mol. Mass.:66230.44
Organism:Homo sapiens (Human)
Description:P03372
Residue:595
BDBM306772
NameBDBM306772
Synonyms:2,2-difluoro-3- ((1R,3R)-1-(4- (2-((3- fluoropropyl) amino)ethoxy)- 2-methoxy- phenyl)-3- methyl- 1,3,4,9- tetrahydro-2H- pyrido[3,4- b]indol-2- yl)propan-1-ol | US10149839, Example 58
TypeSmall organic molecule
Emp. Form.C27H34F3N3O3
Mol. Mass.505.5724
SMILESCOc1cc(OCCNCCCF)ccc1[C@H]1N(CC(F)(F)CO)[C@H](C)Cc2c1[nH]c1ccccc21