Reaction Details
TargetKappa-type opioid receptor
LigandBDBM581034
Substrate/Competitorn/a
Meas. Tech.Opioid Receptor Binding Assay
IC50 0.255±n/a nM
Citation Liao, SYang, JLv, JLiao, ZZhou, HGao, JXie, TYang, Q Peptides for treatment of medical disorders US Patent US11492374 Publication Date 11/8/2022
 
Kappa-type opioid receptor
Name:Kappa-type opioid receptor
Type:G Protein-Coupled Receptor (GPCR)
Mol. Mass.:42648.76
Organism:Homo sapiens (Human)
Description:P41145
Residue:380
BDBM581034
NameBDBM581034
Synonyms:US11492374, ID 13
TypeSmall organic molecule
Emp. Form.C37H55N7O6
Mol. Mass.693.8759
SMILESCOC(=O)C1(N)CCN(C1)C(=O)[C@@H](CCCCN)NC(=O)[C@@H](CC(C)C)NC(=O)[C@@H](Cc1ccccc1)NC(=O)[C@H](N)[C@H](C)c1ccccc1