Reaction Details
TargetKappa-type opioid receptor
LigandBDBM581035
Substrate/Competitorn/a
Meas. Tech.Opioid Receptor Binding Assay
IC50 0.398±n/a nM
Citation Liao, SYang, JLv, JLiao, ZZhou, HGao, JXie, TYang, Q Peptides for treatment of medical disorders US Patent US11492374 Publication Date 11/8/2022
 
Kappa-type opioid receptor
Name:Kappa-type opioid receptor
Type:G Protein-Coupled Receptor (GPCR)
Mol. Mass.:42648.76
Organism:Homo sapiens (Human)
Description:P41145
Residue:380
BDBM581035
NameBDBM581035
Synonyms:US11492374, ID 14
TypeSmall organic molecule
Emp. Form.C36H53N7O6
Mol. Mass.679.8493
SMILESCC(C)C[C@@H](NC(=O)[C@@H](Cc1ccccc1)NC(=O)[C@H](N)[C@H](C)c1ccccc1)C(=O)N[C@H](CCCCN)C(=O)N1CCC(N)(C1)C(O)=O