Reaction Details
TargetAcetylcholinesterase
LigandBDBM8976
Substrate/CompetitorBDBM8959
Meas. Tech.Measurement of FBSAChE/EqBuChE Inhibitory Activity
pH8±n/a
Temperature298.15±n/a K
Ki 130±20 nM
Citation Campiani, GFattorusso, CButini, SGaeta, AAgnusdei, MGemma, SPersico, MCatalanotti, BSavini, LNacci, VNovellino, EHolloway, HWGreig, NHBelinskaya, TFedorko, JMSaxena, A Development of molecular probes for the identification of extra interaction sites in the mid-gorge and peripheral sites of butyrylcholinesterase (BuChE). Rational design of novel, selective, and highly potent BuChE inhibitors. J Med Chem48:1919-29 (2005) 
 
Acetylcholinesterase
Name:Acetylcholinesterase
Type:Enzyme
Mol. Mass.:67792.70
Organism:Homo sapiens (Human)
Description:P22303
Residue:614
BDBM8976
BDBM8959
NameBDBM8976
Synonyms:CHEMBL175555 Tacrine Dimer 4l | methyl[3-(1,2,3,4-tetrahydroacridin-9-ylamino)propyl][4-(1,2,3,4-tetrahydroacridin-9-ylsulfanyl)butyl]amine
TypeSmall organic molecule
Emp. Form.C34H42N4S
Mol. Mass.538.789
SMILESCN(CCCCSc1c2CCCCc2nc2ccccc12)CCCNc1c2CCCCc2nc2ccccc12