Reaction Details
TargetCarboxylic ester hydrolase
LigandBDBM8962
Substrate/CompetitorBDBM8978
Meas. Tech.Measurement of FBSAChE/EqBuChE Inhibitory Activity
Ki 100±n/a nM
Citation Campiani, GFattorusso, CButini, SGaeta, AAgnusdei, MGemma, SPersico, MCatalanotti, BSavini, LNacci, VNovellino, EHolloway, HWGreig, NHBelinskaya, TFedorko, JMSaxena, A Development of molecular probes for the identification of extra interaction sites in the mid-gorge and peripheral sites of butyrylcholinesterase (BuChE). Rational design of novel, selective, and highly potent BuChE inhibitors. J Med Chem48:1919-29 (2005) 
 
Carboxylic ester hydrolase
Name:Carboxylic ester hydrolase
Type:Protein
Mol. Mass.:68842.83
Organism:Equus caballus (Horse)
Description:Q9N1N9
Residue:602
BDBM8962
BDBM8978
NameBDBM8962
Synonyms:Bis-THA inhibitor 4 N-[5-(1,2,3,4-tetrahydroacridin-9-ylamino)pentyl]-1,2,3,4-tetrahydroacridin-9-amine | Tacrine Dimer 3a
TypeSmall organic molecule
Emp. Form.C31H36N4
Mol. Mass.464.6443
SMILESC(CCNc1c2CCCCc2nc2ccccc12)CCNc1c2CCCCc2nc2ccccc12