Reaction Details
TargetCarboxylic ester hydrolase
LigandBDBM8964
Substrate/CompetitorBDBM8978
Meas. Tech.Measurement of FBSAChE/EqBuChE Inhibitory Activity
Ki 2.0±n/a nM
Citation Campiani, GFattorusso, CButini, SGaeta, AAgnusdei, MGemma, SPersico, MCatalanotti, BSavini, LNacci, VNovellino, EHolloway, HWGreig, NHBelinskaya, TFedorko, JMSaxena, A Development of molecular probes for the identification of extra interaction sites in the mid-gorge and peripheral sites of butyrylcholinesterase (BuChE). Rational design of novel, selective, and highly potent BuChE inhibitors. J Med Chem48:1919-29 (2005) 
 
Carboxylic ester hydrolase
Name:Carboxylic ester hydrolase
Type:Protein
Mol. Mass.:68842.83
Organism:Equus caballus (Horse)
Description:Q9N1N9
Residue:602
BDBM8964
BDBM8978
NameBDBM8964
Synonyms:CHEMBL75274 N-[8-(1,2,3,4-tetrahydroacridin-9-ylamino)octyl]-1,2,3,4-tetrahydroacridin-9-amine Tacrine-Based Inhibitor 2g
TypeSmall organic molecule
Emp. Form.C34H42N4
Mol. Mass.506.7241
SMILESC(CCCCNc1c2CCCCc2nc2ccccc12)CCCNc1c2CCCCc2nc2ccccc12