Reaction Details
TargetCholinesterase
LigandBDBM8964
Substrate/CompetitorBDBM8978
Meas. Tech.Enzyme Inhibition Assay
IC50 53±n/a nM
Citation Hu, MKWu, LJHsiao, GYen, MH Homodimeric tacrine congeners as acetylcholinesterase inhibitors. J Med Chem45:2277-82 (2002) 
 
Cholinesterase
Name:Cholinesterase
Type:Homotetramer
Mol. Mass.:68422.27
Organism:Homo sapiens (Human)
Description:P06276
Residue:602
BDBM8964
BDBM8978
NameBDBM8964
Synonyms:CHEMBL75274 N-[8-(1,2,3,4-tetrahydroacridin-9-ylamino)octyl]-1,2,3,4-tetrahydroacridin-9-amine Tacrine-Based Inhibitor 2g
TypeSmall organic molecule
Emp. Form.C34H42N4
Mol. Mass.506.7241
SMILESC(CCCCNc1c2CCCCc2nc2ccccc12)CCCNc1c2CCCCc2nc2ccccc12