Reaction Details
TargetSerine/threonine-protein kinase Chk2
LigandBDBM601395
Substrate/Competitorn/a
Meas. Tech.Activity Test of Compounds in the CHK1 Coupled Reaction System
IC50 13.0±n/a nM
Citation Liao, YQian, WWei, CXiao, YXi, ZZhang, CLi, JChen, S Diazaindole derivative and use thereof as CHK1 inhibitor US Patent US11634424 Publication Date 4/25/2023
 
Serine/threonine-protein kinase Chk2
Name:Serine/threonine-protein kinase Chk2
Type:Protein
Mol. Mass.:60908.59
Organism:Homo sapiens (Human)
Description:O96017
Residue:543
BDBM601395
NameBDBM601395
Synonyms:US11634424, Compound 7
TypeSmall organic molecule
Emp. Form.C21H22FN7O
Mol. Mass.407.4441
SMILESCOc1cccc(F)c1-c1cc(Nc2cnc3ccn(C4CCNCC4)c3n2)n[nH]1