Reaction Details
TargetAcetylcholinesterase
LigandBDBM9410
Substrate/CompetitorBDBM8959
Meas. Tech.Enzyme Inhibition Assay
IC50 0.3±n/a nM
Citation Sugimoto, HTsuchiya, YSugumi, HHigurashi, KKaribe, NIimura, YSasaki, AKawakami, YNakamura, TAraki, S Novel piperidine derivatives. Synthesis and anti-acetylcholinesterase activity of 1-benzyl-4-[2-(N-benzoylamino)ethyl]piperidine derivatives. J Med Chem33:1880-7 (1990) 
 
Acetylcholinesterase
Name:Acetylcholinesterase
Type:Enzyme
Mol. Mass.:68165.65
Organism:Mus musculus (mouse)
Description:n/a
Residue:614
BDBM9410
BDBM8959
NameBDBM9410
Synonyms:N-[2-(1-benzylpiperidin-4-yl)ethyl]-N-ethyl-4-(phenylmethane)sulfonylbenzamide | Piperidine Derivative 22
TypeSmall organic molecule
Emp. Form.C30H36N2O3S
Mol. Mass.504.683
SMILESCCN(CCC1CCN(Cc2ccccc2)CC1)C(=O)c1ccc(cc1)S(=O)(=O)Cc1ccccc1