Reaction Details
TargetVoltage-dependent calcium channel gamma-2 subunit
LigandBDBM311799
Substrate/Competitorn/a
Meas. Tech.Calcium Flux Assay
IC50 0.126±n/a nM
Citation Ameriks, MKLaforteza, BNLebold, TPRavula, SSavall, BMShireman, BT Fused azaheterocyclic compounds and their use as AMPA receptor modulators US Patent US10155769 Publication Date 12/18/2018
 
Voltage-dependent calcium channel gamma-2 subunit
Name:Voltage-dependent calcium channel gamma-2 subunit
Type:Enzyme Catalytic Domain
Mol. Mass.:35977.54
Organism:Homo sapiens (Human)
Description:n/a
Residue:323
BDBM311799
NameBDBM311799
Synonyms:8-(7-Chloro-1H-indazol-5-yl)-2-isopropyl-7-(trifluoromethyl)-[1,2,4]triazolo[1,5-a]pyridine | US10155769, Example 37
TypeSmall organic molecule
Emp. Form.C17H13ClF3N5
Mol. Mass.379.767
SMILESCC(C)c1nc2c(-c3cc(Cl)c4[nH]ncc4c3)c(ccn2n1)C(F)(F)F