Reaction Details
TargetVoltage-dependent calcium channel gamma-2 subunit
LigandBDBM311843
Substrate/Competitorn/a
Meas. Tech.Calcium Flux Assay
IC50 0.126±n/a nM
Citation Ameriks, MKLaforteza, BNLebold, TPRavula, SSavall, BMShireman, BT Fused azaheterocyclic compounds and their use as AMPA receptor modulators US Patent US10155769 Publication Date 12/18/2018
 
Voltage-dependent calcium channel gamma-2 subunit
Name:Voltage-dependent calcium channel gamma-2 subunit
Type:Enzyme Catalytic Domain
Mol. Mass.:35977.54
Organism:Homo sapiens (Human)
Description:n/a
Residue:323
BDBM311843
NameBDBM311843
Synonyms:3-Chloro-8-(7-chloro-1H-indazol-5-yl)-2-cyclopropyl-7-(trifluoromethyl)imidazo[1,2-c]pyrimidine | US10155769, Example 81
TypeSmall organic molecule
Emp. Form.C17H10Cl2F3N5
Mol. Mass.412.196
SMILESFC(F)(F)c1ncn2c(Cl)c(nc2c1-c1cc(Cl)c2[nH]ncc2c1)C1CC1