Reaction Details
TargetDipeptidyl peptidase 4
LigandBDBM50003020
Substrate/Competitorn/a
Meas. Tech.DPP-IV Inhibitory Activity
IC50 4.20±n/a nM
Citation Xu, XShen, YXiao, DLuo, HPeng, YHan, YZhang, AYang, L Substituted amino six-membered saturated heteroalicycles as long-acting DPP-IV inhibitors US Patent US10155775 Publication Date 12/18/2018
 
Dipeptidyl peptidase 4
Name:Dipeptidyl peptidase 4
Type:Enzyme
Mol. Mass.:88271.01
Organism:Homo sapiens (Human)
Description:P27487
Residue:766
BDBM50003020
NameBDBM50003020
Synonyms:MK-3102 US10155775, Omarigliptin US10822319, Compound Omarigliptin
TypeSmall organic molecule
Emp. Form.C17H20F2N4O3S
Mol. Mass.398.428
SMILESCS(=O)(=O)n1cc2CN(Cc2n1)[C@H]1CO[C@@H]([C@@H](N)C1)c1cc(F)ccc1F