Reaction Details
TargetMembrane primary amine oxidase
LigandBDBM309467
Substrate/Competitorn/a
Meas. Tech.Inhibitory Assay
IC50 11.3±n/a nM
Citation Matsukawa, TMasuzaki, KKawasaki, AAkasaka, AKawai, Y Benzene or thiophene derivative and use thereof as VAP-1 inhibitor US Patent US9603833 Publication Date 3/28/2017
 
Membrane primary amine oxidase
Name:Membrane primary amine oxidase
Type:Protein
Mol. Mass.:84620.86
Organism:Homo sapiens (Human)
Description:Q16853
Residue:763
BDBM309467
NameBDBM309467
Synonyms:US9603833, Example 59
TypeSmall organic molecule
Emp. Form.C21H25F3N4O
Mol. Mass.406.4446
SMILESNNC(=O)Cc1ccc(CCc2ccc(cc2C(F)(F)F)N2CCNCC2)cc1