Reaction Details
TargetMembrane primary amine oxidase
LigandBDBM309475
Substrate/Competitorn/a
Meas. Tech.Inhibitory Assay
IC50 3.20±n/a nM
Citation Matsukawa, TMasuzaki, KKawasaki, AAkasaka, AKawai, Y Benzene or thiophene derivative and use thereof as VAP-1 inhibitor US Patent US9603833 Publication Date 3/28/2017
 
Membrane primary amine oxidase
Name:Membrane primary amine oxidase
Type:Protein
Mol. Mass.:84620.86
Organism:Homo sapiens (Human)
Description:Q16853
Residue:763
BDBM309475
NameBDBM309475
Synonyms:US9603833, Example 87
TypeSmall organic molecule
Emp. Form.C21H27N5O2
Mol. Mass.381.4714
SMILESCC(=O)N1CCN(CC1)c1ccc(CCc2ccc(CC(=O)NN)cc2)nc1