Reaction Details
TargetMembrane primary amine oxidase
LigandBDBM309482
Substrate/Competitorn/a
Meas. Tech.Inhibitory Assay
IC50 3.40±n/a nM
Citation Matsukawa, TMasuzaki, KKawasaki, AAkasaka, AKawai, Y Benzene or thiophene derivative and use thereof as VAP-1 inhibitor US Patent US9603833 Publication Date 3/28/2017
 
Membrane primary amine oxidase
Name:Membrane primary amine oxidase
Type:Protein
Mol. Mass.:84620.86
Organism:Homo sapiens (Human)
Description:Q16853
Residue:763
BDBM309482
NameBDBM309482
Synonyms:US9603833, Example 101
TypeSmall organic molecule
Emp. Form.C20H26N6O2
Mol. Mass.382.4594
SMILESCC(=O)N1CCN(CC1)c1cnc(CCc2ccc(CC(=O)NN)cc2)cn1