Reaction Details
TargetApoptosis regulator Bcl-2
LigandBDBM177876
Substrate/Competitorn/a
Meas. Tech.Fluorescence Polarisation Assay
IC50 6.00±n/a nM
Citation Le Diguarher, TCasara, PStarck, JHenlin, JDavidson, JEMurray, JBGraham, CJChen, IGeneste, OHickman, JDepil, SLe Tiran, ANyerges, MDe Nanteuil, G Indolizine compounds, a process for their preparation and pharmaceutical compositions containing them US Patent US9603854 Publication Date 3/28/2017
 
Apoptosis regulator Bcl-2
Name:Apoptosis regulator Bcl-2
Type:Homodimer or heterodimer
Mol. Mass.:26269.11
Organism:Homo sapiens (Human)
Description:P10415
Residue:239
BDBM177876
NameBDBM177876
Synonyms:US9120791, Example 103 | US9603854, 103
TypeSmall organic molecule
Emp. Form.C44H43ClN6O4
Mol. Mass.755.303
SMILESCn1ccc2cc(cnc12)N(C(=O)c1cc(-c2cc(Cl)ccc2C(=O)N2Cc3ccccc3C[C@H]2CN2CCOCC2)n2CCCCc12)c1ccc(O)cc1