Reaction Details
TargetProstaglandin E2 receptor EP4 subtype
LigandBDBM179834
Substrate/Competitorn/a
Meas. Tech.Radioligand Binding Assay
pH6±n/a
Ki 2.10±n/a nM
IC50 5.70±n/a nM
Commentsextracted
Citation Barrett, SDGermain, BDUzieblo, ACiske, FLEndres, GWKornilov, AMaxey, KMO'Malley, JPOwen, TA Lactam compounds as EP4 receptor-selective agonists for use in the treatment of EP4-mediated diseases and conditions US Patent US9676712 Publication Date 6/13/2017
 
Prostaglandin E2 receptor EP4 subtype
Name:Prostaglandin E2 receptor EP4 subtype
Type:Enzyme
Mol. Mass.:53134.53
Organism:Homo sapiens (Human)
Description:P35408
Residue:488
BDBM179834
NameBDBM179834
Synonyms:US9676712, 2C
TypeSmall organic molecule
Emp. Form.C25H37NO4
Mol. Mass.415.5656
SMILESCC(CCCc1ccccc1)[C@@H](O)\C=C\[C@H]1CCC(=O)N1CCCCCCC(O)=O