Reaction Details
TargetRAF proto-oncogene serine/threonine-protein kinase
LigandBDBM313608
Substrate/Competitorn/a
Meas. Tech.In Vitro Raf Activity Determination
IC50 30.0±n/a nM
Citation Aversa, RJBurger, MTDillon, MPDineen, Jr., TALou, YNishiguchi, GARamurthy, SRico, ACRauniyar, VSendzik, MSubramanian, SSetti, LQTaft, BRTanner, HRWan, L Compounds and compositions as RAF kinase inhibitors US Patent US10167279 Publication Date 1/1/2019
 
RAF proto-oncogene serine/threonine-protein kinase
Name:RAF proto-oncogene serine/threonine-protein kinase
Type:Serine/threonine-protein kinase
Mol. Mass.:73082.52
Organism:Homo sapiens (Human)
Description:P04049
Residue:648
BDBM313608
NameBDBM313608
Synonyms:N-(3-(6-ethoxy-5- (tetrahydro-2H-pyran-4- yl)pyridazin-3-yl)-4- methylphenyl)-5- (trifluoromethyl) pyrazine-2-carboxamide | US10167279, Example 232
TypeSmall organic molecule
Emp. Form.C24H24F3N5O3
Mol. Mass.487.4743
SMILESCCOc1nnc(cc1C1CCOCC1)-c1cc(NC(=O)c2cc(ncn2)C(F)(F)F)ccc1C