Reaction Details
TargetRAF proto-oncogene serine/threonine-protein kinase
LigandBDBM313614
Substrate/Competitorn/a
Meas. Tech.In Vitro Raf Activity Determination
IC50 40.0±n/a nM
Citation Aversa, RJBurger, MTDillon, MPDineen, Jr., TALou, YNishiguchi, GARamurthy, SRico, ACRauniyar, VSendzik, MSubramanian, SSetti, LQTaft, BRTanner, HRWan, L Compounds and compositions as RAF kinase inhibitors US Patent US10167279 Publication Date 1/1/2019
 
RAF proto-oncogene serine/threonine-protein kinase
Name:RAF proto-oncogene serine/threonine-protein kinase
Type:Serine/threonine-protein kinase
Mol. Mass.:73082.52
Organism:Homo sapiens (Human)
Description:P04049
Residue:648
BDBM313614
NameBDBM313614
Synonyms:N-(3-(6-ethoxy-5- (tetrahydro-2H-pyran-4- yl)pyridazin-3-yl)-4- methylphenyl)-2- (trifluoromethyl) isonicotinamide | US10167279, Example 239
TypeSmall organic molecule
Emp. Form.C25H25F3N4O3
Mol. Mass.486.4862
SMILESCCOc1nnc(cc1C1CCOCC1)-c1cc(NC(=O)c2ccnc(c2)C(F)(F)F)ccc1C