Reaction Details
TargetRAF proto-oncogene serine/threonine-protein kinase
LigandBDBM313635
Substrate/Competitorn/a
Meas. Tech.In Vitro Raf Activity Determination
IC50 30.0±n/a nM
Citation Aversa, RJBurger, MTDillon, MPDineen, Jr., TALou, YNishiguchi, GARamurthy, SRico, ACRauniyar, VSendzik, MSubramanian, SSetti, LQTaft, BRTanner, HRWan, L Compounds and compositions as RAF kinase inhibitors US Patent US10167279 Publication Date 1/1/2019
 
RAF proto-oncogene serine/threonine-protein kinase
Name:RAF proto-oncogene serine/threonine-protein kinase
Type:Serine/threonine-protein kinase
Mol. Mass.:73082.52
Organism:Homo sapiens (Human)
Description:P04049
Residue:648
BDBM313635
NameBDBM313635
Synonyms:4-chloro-N-(3-(2-(2- hydroxyethoxy)-6- (tetrahydro-2H-pyran-4- yl)pyridin-4-yl)-4- methylphenyl) picolinamide | US10167279, Example 261
TypeSmall organic molecule
Emp. Form.C25H26ClN3O4
Mol. Mass.467.945
SMILESCc1ccc(NC(=O)c2cc(Cl)ccn2)cc1-c1cc(OCCO)nc(c1)C1CCOCC1