Reaction Details
TargetRAF proto-oncogene serine/threonine-protein kinase
LigandBDBM313650
Substrate/Competitorn/a
Meas. Tech.In Vitro Raf Activity Determination
IC50 60.0±n/a nM
Citation Aversa, RJBurger, MTDillon, MPDineen, Jr., TALou, YNishiguchi, GARamurthy, SRico, ACRauniyar, VSendzik, MSubramanian, SSetti, LQTaft, BRTanner, HRWan, L Compounds and compositions as RAF kinase inhibitors US Patent US10167279 Publication Date 1/1/2019
 
RAF proto-oncogene serine/threonine-protein kinase
Name:RAF proto-oncogene serine/threonine-protein kinase
Type:Serine/threonine-protein kinase
Mol. Mass.:73082.52
Organism:Homo sapiens (Human)
Description:P04049
Residue:648
BDBM313650
NameBDBM313650
Synonyms:(R)-N-(3-(2-(2,3- dihydroxypropoxy)-6- (tetrahydro-2H-pyran-4- yl)pyridin-4-yl)-4- methylphenyl)-6- (trifluoromethyl) pyrimidine-4- carboxamide | US10167279, Example 276
TypeSmall organic molecule
Emp. Form.C26H27F3N4O5
Mol. Mass.532.5116
SMILESCc1ccc(NC(=O)c2cc(ncn2)C(F)(F)F)cc1-c1cc(OC[C@H](O)CO)nc(c1)C1CCOCC1