Reaction Details
TargetAldehyde dehydrogenase, mitochondrial
LigandBDBM153684
Substrate/Competitorn/a
Meas. Tech.ALDH2 Assay
IC50 63.0±n/a nM
Citation Cannizzaro, CEGraupe, MGuerrero, JALu, YStrickley, RGVenkataramani, CZablocki, J Compounds for the treatment of addiction US Patent US9610299 Publication Date 4/4/2017
 
Aldehyde dehydrogenase, mitochondrial
Name:Aldehyde dehydrogenase, mitochondrial
Type:Enzyme
Mol. Mass.:56382.67
Organism:Homo sapiens (Human)
Description:P05091
Residue:517
BDBM153684
NameBDBM153684
Synonyms:US10507215, Compound 1 US9610299, Example 1
TypeSmall organic molecule
Emp. Form.C22H20Cl2N2O4
Mol. Mass.447.311
SMILESCOCCOc1cc(Cl)c(C(=O)NCc2ccc(cc2)-c2cc[nH]c(=O)c2)c(Cl)c1