Reaction Details
TargetAldehyde dehydrogenase, mitochondrial
LigandBDBM153690
Substrate/Competitorn/a
Meas. Tech.ALDH2 Assay
IC50 23.0±n/a nM
Citation Cannizzaro, CEGraupe, MGuerrero, JALu, YStrickley, RGVenkataramani, CZablocki, J Compounds for the treatment of addiction US Patent US9610299 Publication Date 4/4/2017
 
Aldehyde dehydrogenase, mitochondrial
Name:Aldehyde dehydrogenase, mitochondrial
Type:Enzyme
Mol. Mass.:56382.67
Organism:Homo sapiens (Human)
Description:P05091
Residue:517
BDBM153690
NameBDBM153690
Synonyms:US10507215, Compound 7 US9610299, Example 7
TypeSmall organic molecule
Emp. Form.C19H13ClF2N2O2
Mol. Mass.374.769
SMILESFc1ccc(F)c(C(=O)NCc2ccc(cc2)-c2cc[nH]c(=O)c2)c1Cl