Reaction Details
TargetMAP kinase-interacting serine/threonine-protein kinase 2
LigandBDBM168343
Substrate/Competitorn/a
Meas. Tech.Mnk Biochemical Enzymatic Assay
Temperature298.15±n/a K
IC50<10.00±n/a nM
Commentsextracted
Citation Reich, SHSprengeler, PAWebber, SEXiang, AXErnst, JT MNK inhibitors and methods related thereto US Patent US9669031 Publication Date 6/6/2017
 
MAP kinase-interacting serine/threonine-protein kinase 2
Name:MAP kinase-interacting serine/threonine-protein kinase 2
Type:Protein
Mol. Mass.:51870.79
Organism:Homo sapiens (Human)
Description:Q9HBH9
Residue:465
BDBM168343
NameBDBM168343
Synonyms:US9669031, 192 8-chloro-3-methyl-3-(2-methylprop-1-enyl)-6-(pyrimidin-4-ylamino)-2H-imidazo[1,5-a]pyridine-1,5-dione (Cpd. No. 192)
TypeSmall organic molecule
Emp. Form.C16H16ClN5O2
Mol. Mass.345.784
SMILES[#6]\[#6](-[#6])=[#6]\C1([#6])[#7]-[#6](=O)-c2c(Cl)cc(-[#7]-c3ccncn3)c(=O)n12