Reaction Details
TargetIntermediate conductance calcium-activated potassium channel protein 4
LigandBDBM314284
Substrate/Competitorn/a
Meas. Tech.Electrophysiology Assay
IC50 42.0±n/a nM
Citation Green, LWang, H Oxazolidinone and imidazolidinone compounds US Patent US9611232 Publication Date 4/4/2017
 
Intermediate conductance calcium-activated potassium channel protein 4
Name:Intermediate conductance calcium-activated potassium channel protein 4
Type:PROTEIN
Mol. Mass.:47723.22
Organism:Homo sapiens (Human)
Description:ChEMBL_1361891
Residue:427
BDBM314284
NameBDBM314284
Synonyms:US9611232, Example 15
TypeSmall organic molecule
Emp. Form.C23H17F3N2O3
Mol. Mass.426.3879
SMILESNC(=O)CN1[C@@H](c2ccccc2F)C(OC1=O)(c1cccc(F)c1)c1cccc(F)c1