Reaction Details
TargetIntermediate conductance calcium-activated potassium channel protein 4
LigandBDBM314288
Substrate/Competitorn/a
Meas. Tech.Electrophysiology Assay
IC50 63.0±n/a nM
Citation Green, LWang, H Oxazolidinone and imidazolidinone compounds US Patent US9611232 Publication Date 4/4/2017
 
Intermediate conductance calcium-activated potassium channel protein 4
Name:Intermediate conductance calcium-activated potassium channel protein 4
Type:PROTEIN
Mol. Mass.:47723.22
Organism:Homo sapiens (Human)
Description:ChEMBL_1361891
Residue:427
BDBM314288
NameBDBM314288
Synonyms:US9611232, Example 19
TypeSmall organic molecule
Emp. Form.C23H17ClF2N2O3
Mol. Mass.442.842
SMILESNC(=O)CN1[C@@H](c2ccccc2Cl)C(OC1=O)(c1ccc(F)cc1)c1ccc(F)cc1