Reaction Details
TargetSteroid 17-alpha-hydroxylase/17,20 lyase
LigandBDBM50358201
Substrate/Competitorn/a
Meas. Tech.Enzyme Activity Assay
IC50 4.00±139 nM
Citation Aube, JScott, EEFehl, C Inhibitors of CYP17A1 US Patent US9611270 Publication Date 4/4/2017
 
Steroid 17-alpha-hydroxylase/17,20 lyase
Name:Steroid 17-alpha-hydroxylase/17,20 lyase
Type:Enzyme
Mol. Mass.:57382.42
Organism:Homo sapiens (Human)
Description:E.coli expressing human CYP17
Residue:508
BDBM50358201
NameBDBM50358201
Synonyms:CHEMBL1921976 | US9611270, orteronel
TypeSmall organic molecule
Emp. Form.C18H17N3O2
Mol. Mass.307.3465
SMILESCNC(=O)c1ccc2cc(ccc2c1)[C@@]1(O)CCn2cncc12