Reaction Details
TargetSteroid 17-alpha-hydroxylase/17,20 lyase
LigandBDBM314731
Substrate/Competitorn/a
Meas. Tech.Enzyme Activity Assay
IC50 1.000±50 nM
Citation Aube, JScott, EEFehl, C Inhibitors of CYP17A1 US Patent US9611270 Publication Date 4/4/2017
 
Steroid 17-alpha-hydroxylase/17,20 lyase
Name:Steroid 17-alpha-hydroxylase/17,20 lyase
Type:Enzyme
Mol. Mass.:57382.42
Organism:Homo sapiens (Human)
Description:E.coli expressing human CYP17
Residue:508
BDBM314731
NameBDBM314731
Synonyms:US9611270, Example 21
TypeSmall organic molecule
Emp. Form.C26H36N2O2
Mol. Mass.408.5762
SMILESCC(=O)N1CC[C@H]2[C@@H]3CC=C(c4cccnc4)[C@@]3(C)CC[C@@H]2[C@@]2(C)CC[C@H](O)C[C@H]12