Reaction Details
TargetSteroid 21-hydroxylase
LigandBDBM314740
Substrate/Competitorn/a
Meas. Tech.Enzyme Activity Assay
IC50 8.00±912 nM
Citation Aube, JScott, EEFehl, C Inhibitors of CYP17A1 US Patent US9611270 Publication Date 4/4/2017
 
Steroid 21-hydroxylase
Name:Steroid 21-hydroxylase
Type:PROTEIN
Mol. Mass.:55896.25
Organism:Homo sapiens (Human)
Description:ChEMBL_1498865
Residue:494
BDBM314740
NameBDBM314740
Synonyms:US9611270, Example 42
TypeSmall organic molecule
Emp. Form.C25H32N2O2
Mol. Mass.392.5338
SMILESC[C@]12CC[C@H]3[C@@H](CC(C(N)=O)=C4C[C@@H](O)CC[C@]34C)[C@@H]1CC=C2c1cccnc1