Reaction Details
TargetHistone deacetylase 4
LigandBDBM293885
Substrate/Competitorn/a
Meas. Tech.Inhibition Assay
IC50 20.0±n/a nM
Citation Dominguez, CMuñoz-Sanjuán, IMaillard, MLuckhurst, CAJarvis, REBürli, RWAllen, DRHaughan, AFBreccia, PVater, HDStott, AJPenrose, SDWall, MSaville-Stones, EAWishart, GHughes, SJ Histone deacetylase inhibitors and compositions and methods of use thereof US Patent US9617259 Publication Date 4/11/2017
 
Histone deacetylase 4
Name:Histone deacetylase 4
Type:Enzyme
Mol. Mass.:119049.39
Organism:Homo sapiens (Human)
Description:P56524
Residue:1084
BDBM293885
NameBDBM293885
Synonyms:(S)-3-(5-Chloropyridin-3- yl)-1-(3-fluoro-2- methylphenyl)-N- hydroxycyclopent-2- enecarboxamide US9617259, 11
TypeSmall organic molecule
Emp. Form.C18H16ClFN2O2
Mol. Mass.346.783
SMILESCc1c(F)cccc1[C@@]1(CCC(=C1)c1cncc(Cl)c1)C(=O)NO