Reaction Details
TargetAmine oxidase [flavin-containing] A
LigandBDBM11007
Substrate/CompetitorBDBM10990
Meas. Tech.MAO Inhibition Assay
pH7.4±n/a
Temperature311.15±n/a K
Ki 6±0.03 nM
Citation Chimenti, FMaccioni, ESecci, DBolasco, AChimenti, PGranese, ABefani, OTurini, PAlcaro, SOrtuso, FCirilli, RLa Torre, FCardia, MCDistinto, S Synthesis, molecular modeling studies, and selective inhibitory activity against monoamine oxidase of 1-thiocarbamoyl-3,5-diaryl-4,5-dihydro-(1H)- pyrazole derivatives. J Med Chem48:7113-22 (2005) 
 
Amine oxidase [flavin-containing] A
Name:Amine oxidase [flavin-containing] A
Type:PROTEIN
Mol. Mass.:59764.63
Organism:Bos taurus
Description:ChEMBL_1501477
Residue:527
BDBM11007
BDBM10990
NameBDBM11007
Synonyms:1-thiocarbamoyl-3,5-diaryl-4,5-dihydro-(1H)-pyrazole deriv. 4 | 5-(4-chlorophenyl)-3-(4-fluorophenyl)-4,5-dihydro-1H-pyrazole-1-carbothioamide
TypeSmall organic molecule
Emp. Form.C16H13ClFN3S
Mol. Mass.333.811
SMILESNC(=S)N1N=C(CC1c1ccc(Cl)cc1)c1ccc(F)cc1