Reaction Details
TargetAmine oxidase [flavin-containing] A
LigandBDBM11012
Substrate/CompetitorBDBM10990
Meas. Tech.MAO Inhibition Assay
pH7.4±n/a
Temperature311.15±n/a K
Ki 50±0.2 nM
Citation Chimenti, FMaccioni, ESecci, DBolasco, AChimenti, PGranese, ABefani, OTurini, PAlcaro, SOrtuso, FCirilli, RLa Torre, FCardia, MCDistinto, S Synthesis, molecular modeling studies, and selective inhibitory activity against monoamine oxidase of 1-thiocarbamoyl-3,5-diaryl-4,5-dihydro-(1H)- pyrazole derivatives. J Med Chem48:7113-22 (2005) 
 
Amine oxidase [flavin-containing] A
Name:Amine oxidase [flavin-containing] A
Type:PROTEIN
Mol. Mass.:59764.63
Organism:Bos taurus
Description:ChEMBL_1501477
Residue:527
BDBM11012
BDBM10990
NameBDBM11012
Synonyms:1-thiocarbamoyl-3,5-diaryl-4,5-dihydro-(1H)-pyrazole deriv. 9 | 5-(furan-2-yl)-3-(thiophen-2-yl)-4,5-dihydro-1H-pyrazole-1-carbothioamide
TypeSmall organic molecule
Emp. Form.C12H11N3OS2
Mol. Mass.277.365
SMILESNC(=S)N1N=C(CC1c1ccco1)c1cccs1