Reaction Details
TargetAmine oxidase [flavin-containing] B
LigandBDBM11005
Substrate/CompetitorBDBM10990
Meas. Tech.MAO Inhibition Assay
pH7.4±n/a
Temperature311.15±n/a K
Ki 10±0.7 nM
Citation Chimenti, FMaccioni, ESecci, DBolasco, AChimenti, PGranese, ABefani, OTurini, PAlcaro, SOrtuso, FCirilli, RLa Torre, FCardia, MCDistinto, S Synthesis, molecular modeling studies, and selective inhibitory activity against monoamine oxidase of 1-thiocarbamoyl-3,5-diaryl-4,5-dihydro-(1H)- pyrazole derivatives. J Med Chem48:7113-22 (2005) 
 
Amine oxidase [flavin-containing] B
Name:Amine oxidase [flavin-containing] B
Type:PROTEIN
Mol. Mass.:58428.94
Organism:Bos taurus
Description:ChEMBL_1501478
Residue:520
BDBM11005
BDBM10990
NameBDBM11005
Synonyms:1-thiocarbamoyl-3,5-diaryl-4,5-dihydro-(1H)-pyrazole deriv. 2 | 3,5-bis(4-methylphenyl)-4,5-dihydro-1H-pyrazole-1-carbothioamide
TypeSmall organic molecule
Emp. Form.C18H19N3S
Mol. Mass.309.429
SMILESCc1ccc(cc1)C1CC(=NN1C(N)=S)c1ccc(C)cc1