Reaction Details
TargetNuclear receptor ROR-gamma
LigandBDBM317876
Substrate/Competitorn/a
Meas. Tech.Binding Assay
Ki<100±n/a nM
Citation Claremon, DADillard, LWDong, CFan, YJia, LLiu, ZLotesta, SDMarcus, ASingh, SBTice, CMYuan, JZhao, WZheng, YZhuang, L Dihydropyrrolopyridine inhibitors of ROR-gamma US Patent US9624217 Publication Date 4/18/2017
 
Nuclear receptor ROR-gamma
Name:Nuclear receptor ROR-gamma
Type:Enzyme Catalytic Domain
Mol. Mass.:58218.40
Organism:Homo sapiens (Human)
Description:P51449
Residue:518
BDBM317876
NameBDBM317876
Synonyms:US10399976, Compound 29 US11535614, Compound 29 | US9624217, Compound 29
TypeSmall organic molecule
Emp. Form.C28H32ClN3O3S
Mol. Mass.526.09
SMILESCCS(=O)(=O)c1ccc(CNC(=O)c2cnc3[C@H](C(C)C)N(Cc4ccc(Cl)cc4)[C@@H](C)c3c2)cc1