Reaction Details
TargetNuclear receptor ROR-gamma
LigandBDBM317980
Substrate/Competitorn/a
Meas. Tech.Binding Assay
Ki<100±n/a nM
Citation Claremon, DADillard, LWDong, CFan, YJia, LLiu, ZLotesta, SDMarcus, ASingh, SBTice, CMYuan, JZhao, WZheng, YZhuang, L Dihydropyrrolopyridine inhibitors of ROR-gamma US Patent US9624217 Publication Date 4/18/2017
 
Nuclear receptor ROR-gamma
Name:Nuclear receptor ROR-gamma
Type:Enzyme Catalytic Domain
Mol. Mass.:58218.40
Organism:Homo sapiens (Human)
Description:P51449
Residue:518
BDBM317980
NameBDBM317980
Synonyms:US10807980, Compound 133 US9624217, Compound 133
TypeSmall organic molecule
Emp. Form.C25H30F3N5O3S
Mol. Mass.537.598
SMILESCCS(=O)(=O)N\C=C(\CNC(=O)c1cnc2[C@H](C(C)C)N(Cc3ccc(cc3)C(F)(F)F)Cc2c1)C=N