Reaction Details
TargetNuclear receptor ROR-gamma
LigandBDBM317991
Substrate/Competitorn/a
Meas. Tech.Binding Assay
Ki<100±n/a nM
Citation Claremon, DADillard, LWDong, CFan, YJia, LLiu, ZLotesta, SDMarcus, ASingh, SBTice, CMYuan, JZhao, WZheng, YZhuang, L Dihydropyrrolopyridine inhibitors of ROR-gamma US Patent US9624217 Publication Date 4/18/2017
 
Nuclear receptor ROR-gamma
Name:Nuclear receptor ROR-gamma
Type:Enzyme Catalytic Domain
Mol. Mass.:58218.40
Organism:Homo sapiens (Human)
Description:P51449
Residue:518
BDBM317991
NameBDBM317991
Synonyms:US10399976, Compound 144 US11535614, Compound 144 | US9624217, Compound 144
TypeSmall organic molecule
Emp. Form.C27H28F4N4O3S
Mol. Mass.564.595
SMILESCCS(=O)(=O)c1cnc(CNC(=O)c2cnc3[C@H](C(C)C)N(Cc4ccc(cc4)C(F)(F)F)Cc3c2)c(F)c1