Reaction Details
TargetDipeptidyl peptidase 4
LigandBDBM11065
Substrate/CompetitorBDBM11057
Meas. Tech.DPPIV Inhibition Assay
pH7.5±n/a
Temperature295.15±n/a K
Ki 317±n/a nM
Citation Pei, ZLi, XLongenecker, Kvon Geldern, TWWiedeman, PELubben, THZinker, BAStewart, KBallaron, SJStashko, MAMika, AKBeno, DWLong, MWells, HKempf-Grote, AJMadar, DJMcDermott, TSBhagavatula, LFickes, MGPireh, DSolomon, LRLake, MREdalji, RFry, EHSham, HLTrevillyan, JM Discovery, structure-activity relationship, and pharmacological evaluation of (5-substituted-pyrrolidinyl-2-carbonyl)-2-cyanopyrrolidines as potent dipeptidyl peptidase IV inhibitors. J Med Chem49:3520-35 (2006) 
 
Dipeptidyl peptidase 4
Name:Dipeptidyl peptidase 4
Type:Enzyme
Mol. Mass.:88271.01
Organism:Homo sapiens (Human)
Description:P27487
Residue:766
BDBM11065
BDBM11057
NameBDBM11065
Synonyms:(2S)-1-{[(2S,5R)-5-(propan-2-yl)pyrrolidin-2-yl]carbonyl}pyrrolidine-2-carbonitrile | 2-cyanopyrrolidine 10i
TypeSmall organic molecule
Emp. Form.C13H21N3O
Mol. Mass.235.3253
SMILESCC(C)[C@H]1CC[C@H](N1)C(=O)N1CCC[C@H]1C#N