Reaction Details
TargetDipeptidyl peptidase 4
LigandBDBM11074
Substrate/CompetitorBDBM11057
Meas. Tech.DPPIV Inhibition Assay
Ki 8.9±n/a nM
Citation Pei, ZLi, XLongenecker, Kvon Geldern, TWWiedeman, PELubben, THZinker, BAStewart, KBallaron, SJStashko, MAMika, AKBeno, DWLong, MWells, HKempf-Grote, AJMadar, DJMcDermott, TSBhagavatula, LFickes, MGPireh, DSolomon, LRLake, MREdalji, RFry, EHSham, HLTrevillyan, JM Discovery, structure-activity relationship, and pharmacological evaluation of (5-substituted-pyrrolidinyl-2-carbonyl)-2-cyanopyrrolidines as potent dipeptidyl peptidase IV inhibitors. J Med Chem49:3520-35 (2006) 
 
Dipeptidyl peptidase 4
Name:Dipeptidyl peptidase 4
Type:Enzyme
Mol. Mass.:88271.01
Organism:Homo sapiens (Human)
Description:P27487
Residue:766
BDBM11074
BDBM11057
NameBDBM11074
Synonyms:(2S)-1-{[(2S,5R)-5-{[(4-bromophenyl)amino]methyl}pyrrolidin-2-yl]carbonyl}pyrrolidine-2-carbonitrile | 2-cyanopyrrolidine 19b
TypeSmall organic molecule
Emp. Form.C17H21BrN4O
Mol. Mass.377.279
SMILESBrc1ccc(NC[C@H]2CC[C@H](N2)C(=O)N2CCC[C@H]2C#N)cc1