Reaction Details
TargetDipeptidyl peptidase 4
LigandBDBM11099
Substrate/CompetitorBDBM11057
Meas. Tech.DPPIV Inhibition Assay
Ki 1.6±n/a nM
Citation Pei, ZLi, XLongenecker, Kvon Geldern, TWWiedeman, PELubben, THZinker, BAStewart, KBallaron, SJStashko, MAMika, AKBeno, DWLong, MWells, HKempf-Grote, AJMadar, DJMcDermott, TSBhagavatula, LFickes, MGPireh, DSolomon, LRLake, MREdalji, RFry, EHSham, HLTrevillyan, JM Discovery, structure-activity relationship, and pharmacological evaluation of (5-substituted-pyrrolidinyl-2-carbonyl)-2-cyanopyrrolidines as potent dipeptidyl peptidase IV inhibitors. J Med Chem49:3520-35 (2006) 
 
Dipeptidyl peptidase 4
Name:Dipeptidyl peptidase 4
Type:Enzyme
Mol. Mass.:88271.01
Organism:Homo sapiens (Human)
Description:P27487
Residue:766
BDBM11099
BDBM11057
NameBDBM11099
Synonyms:2-cyanopyrrolidine 21af | 4-{[(2R,5S)-5-{[(2S)-2-cyanopyrrolidin-1-yl]carbonyl}pyrrolidin-2-yl]methoxy}-3-methoxybenzoic acid
TypeSmall organic molecule
Emp. Form.C19H23N3O5
Mol. Mass.373.403
SMILESCOc1cc(ccc1OC[C@H]1CC[C@H](N1)C(=O)N1CCC[C@H]1C#N)C(O)=O