Reaction Details
TargetDipeptidyl peptidase 4
LigandBDBM11112
Substrate/CompetitorBDBM11057
Meas. Tech.DPPIV Inhibition Assay
Ki 0.66±n/a nM
Citation Pei, ZLi, XLongenecker, Kvon Geldern, TWWiedeman, PELubben, THZinker, BAStewart, KBallaron, SJStashko, MAMika, AKBeno, DWLong, MWells, HKempf-Grote, AJMadar, DJMcDermott, TSBhagavatula, LFickes, MGPireh, DSolomon, LRLake, MREdalji, RFry, EHSham, HLTrevillyan, JM Discovery, structure-activity relationship, and pharmacological evaluation of (5-substituted-pyrrolidinyl-2-carbonyl)-2-cyanopyrrolidines as potent dipeptidyl peptidase IV inhibitors. J Med Chem49:3520-35 (2006) 
 
Dipeptidyl peptidase 4
Name:Dipeptidyl peptidase 4
Type:Enzyme
Mol. Mass.:88271.01
Organism:Homo sapiens (Human)
Description:P27487
Residue:766
BDBM11112
BDBM11057
NameBDBM11112
Synonyms:2-cyanopyrrolidine 21as | N-(4-chloro-3-{[(2R,5S)-5-{[(2S)-2-cyanopyrrolidin-1-yl]carbonyl}pyrrolidin-2-yl]methoxy}phenyl)-1H-pyrazole-3-carboxamide
TypeSmall organic molecule
Emp. Form.C21H23ClN6O3
Mol. Mass.442.899
SMILESClc1ccc(NC(=O)c2ccn[nH]2)cc1OC[C@H]1CC[C@H](N1)C(=O)N1CCC[C@H]1C#N