Reaction Details
Target5-hydroxytryptamine receptor 2A
LigandBDBM319609
Substrate/Competitorn/a
Meas. Tech.5-HT2A Receptor Antagonism Activity Test
IC50 2.90±n/a nM
Citation Jiang, HWang, ZLi, JZhang, RHe, YLiu, YBi, MLiu, ZTian, GChen, WYang, FWu, CWang, YJiang, XYin, JWang, GShen, J Heterocyclic compounds, process for preparation of the same and use thereof US Patent US10174011 Publication Date 1/8/2019
 
5-hydroxytryptamine receptor 2A
Name:5-hydroxytryptamine receptor 2A
Type:undefined
Mol. Mass.:52607.65
Organism:Homo sapiens (Human)
Description:P28223
Residue:471
BDBM319609
NameBDBM319609
Synonyms:3-(2-(4-(benzo[b]thiophen-4-yl)piperazin-1-yl)ethyl)-9-hydroxy-2-methyl-6,7,8,9-tetrahydro-4H-pyrido[1,2-a]pyrimidin-4-one | US10174011, Example 4
TypeSmall organic molecule
Emp. Form.C23H28N4O2S
Mol. Mass.424.559
SMILESCc1nc2C(O)CCCn2c(=O)c1CCN1CCN(CC1)c1cccc2sccc12