Reaction Details
TargetEctonucleotide pyrophosphatase/phosphodiesterase family member 2
LigandBDBM321868
Substrate/Competitorn/a
Meas. Tech.ATX Assay
IC50 3.50±n/a nM
Citation Beattie, DBaettig, ULe Grand, DMLister, ASMcKenna, JPearce, DWSandham, DASteward, ORThomson, C Autotaxin inhibitors US Patent US10183025 Publication Date 1/22/2019
 
Ectonucleotide pyrophosphatase/phosphodiesterase family member 2
Name:Ectonucleotide pyrophosphatase/phosphodiesterase family member 2
Type:Enzyme
Mol. Mass.:99007.13
Organism:Homo sapiens (Human)
Description:Q13822
Residue:863
BDBM321868
NameBDBM321868
Synonyms:US10183025, Example 5a | US9763957, Example 5b
TypeSmall organic molecule
Emp. Form.C21H22F3N7O2
Mol. Mass.461.4403
SMILESCc1noc(n1)[C@@H]1CCCCN1C(=O)\C=C\c1ccc(cc1Cn1nnc(C)n1)C(F)(F)F