Reaction Details
TargetEctonucleotide pyrophosphatase/phosphodiesterase family member 2
LigandBDBM321963
Substrate/Competitorn/a
Meas. Tech.ATX Assay
IC50 4.20±n/a nM
Citation Beattie, DBaettig, ULe Grand, DMLister, ASMcKenna, JPearce, DWSandham, DASteward, ORThomson, C Autotaxin inhibitors US Patent US10183025 Publication Date 1/22/2019
 
Ectonucleotide pyrophosphatase/phosphodiesterase family member 2
Name:Ectonucleotide pyrophosphatase/phosphodiesterase family member 2
Type:Enzyme
Mol. Mass.:99007.13
Organism:Homo sapiens (Human)
Description:Q13822
Residue:863
BDBM321963
NameBDBM321963
Synonyms:(R,E)-3-(2-((5-Methyl-2H-tetrazol-2-yl)methyl)-4-(trifluoromethyl)phenyl)-1-(2-methyl-4-((1-methyl-1H-pyrazol-4-yl)methyl)piperazin-1-yl)prop-2-en-1-one US9763957, Example 70
TypeSmall organic molecule
Emp. Form.C23H27F3N8O
Mol. Mass.488.5087
SMILESC[C@@H]1CN(Cc2cnn(C)c2)CCN1C(=O)\C=C\c1ccc(cc1Cn1nnc(C)n1)C(F)(F)F