Reaction Details
TargetEctonucleotide pyrophosphatase/phosphodiesterase family member 2
LigandBDBM321991
Substrate/Competitorn/a
Meas. Tech.ATX Assay
IC50 3.50±n/a nM
Citation Beattie, DBaettig, ULe Grand, DMLister, ASMcKenna, JPearce, DWSandham, DASteward, ORThomson, C Autotaxin inhibitors US Patent US10183025 Publication Date 1/22/2019
 
Ectonucleotide pyrophosphatase/phosphodiesterase family member 2
Name:Ectonucleotide pyrophosphatase/phosphodiesterase family member 2
Type:Enzyme
Mol. Mass.:99007.13
Organism:Homo sapiens (Human)
Description:Q13822
Residue:863
BDBM321991
NameBDBM321991
Synonyms:(E)-1-(4-((1-Methyl-1H-pyrazol-3-yl)methyl)piperazin-1-yl)-3-(2-((5-methyl-2H-tetrazol-2-yl)methyl)-4-(trifluoromethyl)phenyl)prop-2-en-1-one US9763957, Example 89
TypeSmall organic molecule
Emp. Form.C22H25F3N8O
Mol. Mass.474.4821
SMILESCc1nnn(Cc2cc(ccc2\C=C\C(=O)N2CCN(Cc3ccn(C)n3)CC2)C(F)(F)F)n1